web-dev-qa-db-de.com

com.Android.ide.common.process.ProcessException: Fehler beim Ausführen von aapt! Was kann ich machen?

Ich erhalte eine Fehlermeldung, wenn ich versuche, auf einem Android-Gerät auszuführen. Ich habe keine Ahnung, was los ist!

Was kann ich tun, um das Problem zu lösen?

FEHLER: Die Erstellung ist mit einer Ausnahme fehlgeschlagen.

BUILD FAILED

Total time: 7.791 secs

* What went wrong:
Execution failed for task ':processDebugResources'.
> com.Android.ide.common.process.ProcessException: Failed to execute aapt

* Try:
Run with --stacktrace option to get the stack trace. Run with --info or --debug option to get more log output.
Error: cmd: Command failed with exit code 1 Error output:
C:\tmp\myproj\platforms\Android\build\intermediates\res\merged\debug\values\values.xml:373: AAPT: Attribute "theme" already defined with incompatible format.

C:\tmp\myproj\platforms\Android\build\intermediates\res\merged\debug\values\values.xml:359: AAPT: Original attribute defined here.

C:\tmp\myproj\platforms\Android\build\intermediates\res\merged\debug\values-v26\values-v26.xml:15:21-54: AAPT: No resource found that matches the given name: attr 'Android:keyboardNavigationCluster'.

C:\tmp\myproj\platforms\Android\build\intermediates\res\merged\debug\values\values.xml:373: error: Attribute "theme" already defined with incompatible format.
C:\tmp\myproj\platforms\Android\build\intermediates\res\merged\debug\values\values.xml:359: Original attribute defined here.
C:\tmp\myproj\platforms\Android\build\intermediates\res\merged\debug\values-v26\values-v26.xml:15: error: Error: No resource found that matches the given name: attr 'Android:keyboardNavigationCluster'.



FAILURE: Build failed with an exception.

* What went wrong:
Execution failed for task ':processDebugResources'.
> com.Android.ide.common.process.ProcessException: Failed to execute aapt

* Try:
Run with --stacktrace option to get the stack trace. Run with --info or --debug option to get more log output.

[ERROR] An error occurred while running cordova run Android (exit code 1).

gelöst

Gelöst: Erstellen Sie das Projekt neu und fügen Sie die Funktionen erneut hinzu!

6
Caio Frota

fügen Sie diesen Code einfach in build.gradle im letzten Teil ein

configurations.all {
    resolutionStrategy {
        force 'com.Android.support:support-v4:27.1.0'
    }
}
13
JSmith

Wenn Sie die Version v4 v7 auf 26.0.0, Aktualisieren, sollten Sie auch CompileSdkVersion und BuildToolsVersion auf 26.0.0 ändern

4
Strong

Merkwürdige Ursache für diesen Fehler war für mich, dass mir ein von einem Layout ablesbares Element fehlte. Ich habe das Layout aus einem anderen Projekt kopiert und vor dem Ausführen meines Projekts vergessen, das Zeichenobjekt zu kopieren .. __ Überprüfen Sie außerdem, ob die Aktivitätsnamen in Ihren Layouts keine Leerzeichen enthalten.

0